# Something went wrong when we tried to build your project

**URL:** <https://community.thunkable.com/t/something-went-wrong-when-we-tried-to-build-your-project/1737253>\
**Category:** Questions about Thunkable X\
**Created:** [February 16, 2022, 9:21am UTC](https://community.thunkable.com/t/something-went-wrong-when-we-tried-to-build-your-project/1737253 "2022-02-16T09:21:06Z")\
**Posts on this page:** 20\
**Page:** 1

<div class="post-metadata">

**Author:** ![mephjl](https://sea1.discourse-cdn.com/flex015/user_avatar/community.thunkable.com/mephjl/32/126746_2.png) [@mephjl](https://community.thunkable.com/u/mephjl)\
**Post date:** [February 16, 2022, 9:21am UTC](https://community.thunkable.com/t/something-went-wrong-when-we-tried-to-build-your-project/1737253/1 "2022-02-16T09:21:06Z")

</div>

Error: Command failed: cd /thunkable/androidBuildServer/…/thunkableCompanion/android/; ./gradlew AssembleRelease ⚠ Cannot resolve the path to “@react-native-community/cli” package. ⚠ Cannot resolve the path to “@react-native-community/cli” package. Failed to construct transformer: Error: Call retries were exceeded at ChildProcessWorker.initialize (/thunkable/thunkableCompanion/node\_modules/jest-worker/build/workers/ChildProcessWorker.js:193:21) at ChildProcessWorker.\_onExit (/thunkable/thunkableCompanion/node\_modules/jest-worker/build/workers/ChildProcessWorker.js:274:12) at ChildProcess.emit (events.js:375:28) at Process.ChildProcess.\_handle.onexit (internal/child\_process.js:277:12) { type: ‘WorkerError’ } error Call retries were exceeded. FAILURE: Build failed with an exception. \* What went wrong: Execution failed for task ‘:app:bundleReleaseJsAndAssets’. \> Process ‘command ‘node’’ finished with non-zero exit value 1 \* Try: Run with --stacktrace option to get the stack trace. Run with --info or --debug option to get more log output. Run with --scan to get full insights. \* Get more help at [https://help.gradle.org](https://help.gradle.org) BUILD FAILED in 2m 51s

What’s this ?

---

<div class="post-metadata">

**Author:** ![muneer](https://sea1.discourse-cdn.com/flex015/user_avatar/community.thunkable.com/muneer/32/75210_2.png) [@muneer](https://community.thunkable.com/u/muneer)\
**Post date:** [February 16, 2022, 9:48am UTC](https://community.thunkable.com/t/something-went-wrong-when-we-tried-to-build-your-project/1737253/2 "2022-02-16T09:48:43Z")

</div>

Why are you posting the same thing in **more than one POST**

[https://community.thunkable.com/t/add-components-in-my-projects/1720847/17?u=muneer](https://community.thunkable.com/t/add-components-in-my-projects/1720847/17)

---

<div class="post-metadata">

**Author:** ![mephjl](https://sea1.discourse-cdn.com/flex015/user_avatar/community.thunkable.com/mephjl/32/126746_2.png) [@mephjl](https://community.thunkable.com/u/mephjl)\
**Post date:** [February 16, 2022, 10:37am UTC](https://community.thunkable.com/t/something-went-wrong-when-we-tried-to-build-your-project/1737253/3 "2022-02-16T10:37:41Z")

</div>

deleted one.  
I’m not thunkable and forum expert like you.  
I need help, but I haven’t. I have only newest problems.  
Now i can’t built my app and I don’t know what to do anymore.  
Is there a real support or just wasting time on this forum ?  
I paid for a member, but haven’t support. In live test my app is ok, but when I create APK the system give me ERROR and don’t send me the apk. Is it normal ? Bohhh

---

<div class="post-metadata">

**Author:** ![muneer](https://sea1.discourse-cdn.com/flex015/user_avatar/community.thunkable.com/muneer/32/75210_2.png) [@muneer](https://community.thunkable.com/u/muneer)\
**Post date:** [February 16, 2022, 11:03am UTC](https://community.thunkable.com/t/something-went-wrong-when-we-tried-to-build-your-project/1737253/4 "2022-02-16T11:03:05Z")

</div>

> [@mephjl](#):
>
> Now i can’t built my app and I don’t know what to do anymore.

The time you requested to build your APK could be a time of backup or sudden internet fluctuation or any other issue. Just wait for sometime and try again and it should be OK.

I just tested the [server status](http://status.thunkable.com/) and all seems to be OK.

---

<div class="post-metadata">

**Author:** ![abedo](https://sea1.discourse-cdn.com/flex015/user_avatar/community.thunkable.com/abedo/32/6468_2.png) [@abedo](https://community.thunkable.com/u/abedo)\
**Post date:** [February 16, 2022, 11:22am UTC](https://community.thunkable.com/t/something-went-wrong-when-we-tried-to-build-your-project/1737253/5 "2022-02-16T11:22:42Z")

</div>

I’m facing the same issue. i have tried to build my app for 3 times

---

<div class="post-metadata">

**Author:** ![mephjl](https://sea1.discourse-cdn.com/flex015/user_avatar/community.thunkable.com/mephjl/32/126746_2.png) [@mephjl](https://community.thunkable.com/u/mephjl)\
**Post date:** [February 16, 2022, 11:22am UTC](https://community.thunkable.com/t/something-went-wrong-when-we-tried-to-build-your-project/1737253/6 "2022-02-16T11:22:59Z")

</div>

first request : 10:04;  
second request: 10:15;  
third request: 12:15

always error. This is the last

Error: Command failed: cd /thunkable/androidBuildServer/…/thunkableCompanion/android/; ./gradlew AssembleRelease ⚠ Cannot resolve the path to “@react-native-community/cli” package. ⚠ Cannot resolve the path to “@react-native-community/cli” package. error node\_modules/public-encrypt/node\_modules/bn.js/lib/bn.js: Call retries were exceeded. FAILURE: Build failed with an exception. \* What went wrong: Execution failed for task ‘:app:bundleReleaseJsAndAssets’. \> Process ‘command ‘node’’ finished with non-zero exit value 1 \* Try: Run with --stacktrace option to get the stack trace. Run with --info or --debug option to get more log output. Run with --scan to get full insights. \* Get more help at [https://help.gradle.org](https://help.gradle.org) BUILD FAILED in 6m 27s

---

<div class="post-metadata">

**Author:** ![muneer](https://sea1.discourse-cdn.com/flex015/user_avatar/community.thunkable.com/muneer/32/75210_2.png) [@muneer](https://community.thunkable.com/u/muneer)\
**Post date:** [February 16, 2022, 11:25am UTC](https://community.thunkable.com/t/something-went-wrong-when-we-tried-to-build-your-project/1737253/7 "2022-02-16T11:25:17Z")

</div>

You will need to wait until one from Thunkable come online.  
@domhnallohanlon @jared @wei @jane @cassandra

---

<div class="post-metadata">

**Author:** ![mephjl](https://sea1.discourse-cdn.com/flex015/user_avatar/community.thunkable.com/mephjl/32/126746_2.png) [@mephjl](https://community.thunkable.com/u/mephjl)\
**Post date:** [February 16, 2022, 2:12pm UTC](https://community.thunkable.com/t/something-went-wrong-when-we-tried-to-build-your-project/1737253/8 "2022-02-16T14:12:38Z")

</div>

now work, BUT there is thunkable splash screen and the alert not work with screen1 opens

---

<div class="post-metadata">

**Author:** ![mephjl](https://sea1.discourse-cdn.com/flex015/user_avatar/community.thunkable.com/mephjl/32/126746_2.png) [@mephjl](https://community.thunkable.com/u/mephjl)\
**Post date:** [February 16, 2022, 2:29pm UTC](https://community.thunkable.com/t/something-went-wrong-when-we-tried-to-build-your-project/1737253/9 "2022-02-16T14:29:30Z")

</div>

now i have rebuilt the app but it does not install. The “NOT INSTALLED” error appears on the mobile phone. it’s frustrating

 ![WhatsApp Image 2022-02-16 at 15.27.56](https://us1.discourse-cdn.com/flex015/uploads/thunkable/original/3X/1/7/176a6a4718174e1d56355215c4f193de3d59f2d5.jpeg)

---

<div class="post-metadata">

**Author:** ![jared](https://sea1.discourse-cdn.com/flex015/user_avatar/community.thunkable.com/jared/32/138473_2.png) [@jared](https://community.thunkable.com/u/jared)\
**Post date:** [February 16, 2022, 2:53pm UTC](https://community.thunkable.com/t/something-went-wrong-when-we-tried-to-build-your-project/1737253/10 "2022-02-16T14:53:24Z")

</div>

Good morning. Sorry this is happening, let me try to help you here.

> [@mephjl](#):
>
> paid for a member, but haven’t support.

Sorry about that. Our live support channel is online from 9-5 EST Mon - Fri. I’m here now for you 🙂

> [@mephjl](#):
>
> ve rebuilt the app but it

Can you (@mephjl and @abedo ) share a project URL with me? Feel free to share via DM.

I’ll look into this further on our end.

---

<div class="post-metadata">

**Author:** ![mephjl](https://sea1.discourse-cdn.com/flex015/user_avatar/community.thunkable.com/mephjl/32/126746_2.png) [@mephjl](https://community.thunkable.com/u/mephjl)\
**Post date:** [February 16, 2022, 3:41pm UTC](https://community.thunkable.com/t/something-went-wrong-when-we-tried-to-build-your-project/1737253/11 "2022-02-16T15:41:46Z")

</div>

post my project url via DM to you, thank you

---

<div class="post-metadata">

**Author:** ![muneer](https://sea1.discourse-cdn.com/flex015/user_avatar/community.thunkable.com/muneer/32/75210_2.png) [@muneer](https://community.thunkable.com/u/muneer)\
**Post date:** [February 16, 2022, 4:20pm UTC](https://community.thunkable.com/t/something-went-wrong-when-we-tried-to-build-your-project/1737253/12 "2022-02-16T16:20:22Z")

</div>

Hello @mephjl

I just made this sample project and generated the APK and it worked fine with me  
[https://x.thunkable.com/projectPage/620d218825a8b1001109cbf9](https://x.thunkable.com/projectPage/620d218825a8b1001109cbf9)

Should you want to try my APK, I can send you the share link by DM.

---

<div class="post-metadata">

**Author:** ![mephjl](https://sea1.discourse-cdn.com/flex015/user_avatar/community.thunkable.com/mephjl/32/126746_2.png) [@mephjl](https://community.thunkable.com/u/mephjl)\
**Post date:** [February 16, 2022, 5:04pm UTC](https://community.thunkable.com/t/something-went-wrong-when-we-tried-to-build-your-project/1737253/13 "2022-02-16T17:04:56Z")

</div>

I just wish my APK would work, I need it for today.  
is the sixth attempt I make since this morning at 10:00 AM, now it’s 06:00PM  
8 hour and I can’t have my working APK

---

<div class="post-metadata">

**Author:** ![mephjl](https://sea1.discourse-cdn.com/flex015/user_avatar/community.thunkable.com/mephjl/32/126746_2.png) [@mephjl](https://community.thunkable.com/u/mephjl)\
**Post date:** [February 16, 2022, 5:17pm UTC](https://community.thunkable.com/t/something-went-wrong-when-we-tried-to-build-your-project/1737253/14 "2022-02-16T17:17:49Z")

</div>

my 6th APK work, not the alert, but I don’t want it anymore.  
I deleted it in my project. but why there is thunkable splash screen ?  
I can not handle it anymore

---

<div class="post-metadata">

**Author:** ![muneer](https://sea1.discourse-cdn.com/flex015/user_avatar/community.thunkable.com/muneer/32/75210_2.png) [@muneer](https://community.thunkable.com/u/muneer)\
**Post date:** [February 16, 2022, 5:32pm UTC](https://community.thunkable.com/t/something-went-wrong-when-we-tried-to-build-your-project/1737253/15 "2022-02-16T17:32:22Z")

</div>

> [@mephjl](#):
>
> why there is thunkable splash screen ?

If you are a PRO member then you need to go to project settings page and upload a project icon.

When you do this, your icon will replace the Thunkable Beaver in the startup screen.

For the Alert about the internet connection, you need to give the app just additional wait time (see my project that I shared which I used a wait block with 0.125 of a second).

The `Screen Opens` needs at least 1 hundredth of a second to load the alert internal component.

---

<div class="post-metadata">

**Author:** ![mephjl](https://sea1.discourse-cdn.com/flex015/user_avatar/community.thunkable.com/mephjl/32/126746_2.png) [@mephjl](https://community.thunkable.com/u/mephjl)\
**Post date:** [February 16, 2022, 5:38pm UTC](https://community.thunkable.com/t/something-went-wrong-when-we-tried-to-build-your-project/1737253/16 "2022-02-16T17:38:30Z")

</div>

> [@muneer](#):
>
> If you are a PRO member then you need to go to project settings page and upload a project icon.

I’m a Starter, but I signed it today. I did not know this. Do I lose my money for this to change my plan?  
Can I pay only the difference ?

---

<div class="post-metadata">

**Author:** ![muneer](https://sea1.discourse-cdn.com/flex015/user_avatar/community.thunkable.com/muneer/32/75210_2.png) [@muneer](https://community.thunkable.com/u/muneer)\
**Post date:** [February 16, 2022, 5:43pm UTC](https://community.thunkable.com/t/something-went-wrong-when-we-tried-to-build-your-project/1737253/17 "2022-02-16T17:43:54Z")

</div>

> [@mephjl](#):
>
> Can I pay only the difference ?

I’m not sure. I’m just a user like you. You will need to get in touch with Thunkable staff.

@jared can you comment on this?  
Is the starter package allowed to add a project icon?

---

<div class="post-metadata">

**Author:** ![mephjl](https://sea1.discourse-cdn.com/flex015/user_avatar/community.thunkable.com/mephjl/32/126746_2.png) [@mephjl](https://community.thunkable.com/u/mephjl)\
**Post date:** [February 16, 2022, 5:54pm UTC](https://community.thunkable.com/t/something-went-wrong-when-we-tried-to-build-your-project/1737253/18 "2022-02-16T17:54:30Z")

</div>

in my project there is the app icon

---

<div class="post-metadata">

**Author:** ![muneer](https://sea1.discourse-cdn.com/flex015/user_avatar/community.thunkable.com/muneer/32/75210_2.png) [@muneer](https://community.thunkable.com/u/muneer)\
**Post date:** [February 16, 2022, 6:05pm UTC](https://community.thunkable.com/t/something-went-wrong-when-we-tried-to-build-your-project/1737253/19 "2022-02-16T18:05:02Z")

</div>

This only means you need to upgrade to **PRO**. @jared @domhnallohanlon is what I’m assuming correct?

---

<div class="post-metadata">

**Author:** ![mephjl](https://sea1.discourse-cdn.com/flex015/user_avatar/community.thunkable.com/mephjl/32/126746_2.png) [@mephjl](https://community.thunkable.com/u/mephjl)\
**Post date:** [February 16, 2022, 6:06pm UTC](https://community.thunkable.com/t/something-went-wrong-when-we-tried-to-build-your-project/1737253/20 "2022-02-16T18:06:45Z")

</div>

there’s nobody here, it’s been hours since @jared said he was helping me.  
they should hire you, you’re the only one who tried to help me

[Next page](https://community.thunkable.com/t/something-went-wrong-when-we-tried-to-build-your-project/1737253.md?page=2)
