# Problemas ao publicar meu aplicativo Android

**URL:** <https://community.thunkable.com/t/problemas-ao-publicar-meu-aplicativo-android/1969781>\
**Category:** Issues / Bugs\
**Created:** [July 20, 2022, 4:59pm UTC](https://community.thunkable.com/t/problemas-ao-publicar-meu-aplicativo-android/1969781 "2022-07-20T16:59:11Z")\
**Posts on this page:** 4\
**Page:** 1

<div class="post-metadata">

**Author:** ![aulapernambucoy6lo2i](https://avatars.discourse-cdn.com/v4/letter/a/bbce88/32.png) [@aulapernambucoy6lo2i](https://community.thunkable.com/u/aulapernambucoy6lo2i)\
**Post date:** [July 20, 2022, 4:59pm UTC](https://community.thunkable.com/t/problemas-ao-publicar-meu-aplicativo-android/1969781/1 "2022-07-20T16:59:11Z")

</div>

Ao clicar em “Download Android”, o Thunkable manda um email para poder baixar o app.  
Mas, toda vez que algo deu errado para construir meu app!

Não entendo como consertar isso!  
Me ajudem por favor!

**Something went wrong when we tried to build your project**

Here are the details:

Error: Command failed: cd /thunkable/androidBuildServer/…/thunkableCompanion/android/; ./gradlew AssembleRelease ![⚠️](https://fonts.gstatic.com/s/e/notoemoji/14.0/26a0_fe0f/32.png) Cannot resolve the path to “@react-native-community/cli” package. ![⚠️](https://fonts.gstatic.com/s/e/notoemoji/14.0/26a0_fe0f/32.png) Cannot resolve the path to “@react-native-community/cli” package. FAILURE: Build failed with an exception. \* What went wrong: Execution failed for task ‘:app:packageRelease’. \> A failure occurred while executing com.android.build.gradle.internal.tasks.Workers$ActionFacade \> com.android.ide.common.signing.KeytoolException: Failed to read key AndroidKey from store “/thunkable/thunkableCompanion/android/upload.keystore”: Keystore was tampered with, or password was incorrect \* Try: Run with --stacktrace option to get the stack trace. Run with --info or --debug option to get more log output. Run with --scan to get full insights. \* Get more help at [https://help.gradle.org](https://help.gradle.org/) BUILD FAILED in 2m 23s

---

<div class="post-metadata">

**Author:** ![zander](https://avatars.discourse-cdn.com/v4/letter/z/ecb155/32.png) [@zander](https://community.thunkable.com/u/zander)\
**Post date:** [July 24, 2022, 2:14am UTC](https://community.thunkable.com/t/problemas-ao-publicar-meu-aplicativo-android/1969781/2 "2022-07-24T02:14:54Z")

</div>

Here are a few possible solutions to try and fix the issue you are facing.

1. Remix your project then try to download it again
2. Download the andriod keystore, then reupload it (this one always works for me)

---

<div class="post-metadata">

**Author:** ![jared](https://sea1.discourse-cdn.com/flex015/user_avatar/community.thunkable.com/jared/32/138473_2.png) [@jared](https://community.thunkable.com/u/jared)\
**Post date:** [July 25, 2022, 1:55pm UTC](https://community.thunkable.com/t/problemas-ao-publicar-meu-aplicativo-android/1969781/3 "2022-07-25T13:55:29Z")

</div>

Hey @aulapernambucoy6lo2i

Have you had the time to try either of @zander’s suggestions? Those would both me mine. Are you publishing your own app or was this a copy or remix of another app?

---

<div class="post-metadata">

**Author:** ![ioannis](https://sea1.discourse-cdn.com/flex015/user_avatar/community.thunkable.com/ioannis/32/146956_2.png) [@ioannis](https://community.thunkable.com/u/ioannis)\
**Post date:** [November 8, 2024, 1:13pm UTC](https://community.thunkable.com/t/problemas-ao-publicar-meu-aplicativo-android/1969781/4 "2024-11-08T13:13:04Z")

</div>


