# Oops! my project did not build - Android

**URL:** <https://community.thunkable.com/t/oops-my-project-did-not-build-android/1944973>\
**Category:** Issues / Bugs\
**Created:** [June 29, 2022, 6:17am UTC](https://community.thunkable.com/t/oops-my-project-did-not-build-android/1944973 "2022-06-29T06:17:14Z")\
**Posts on this page:** 7\
**Page:** 1

<div class="post-metadata">

**Author:** ![uyenchowjkj8](https://sea1.discourse-cdn.com/flex015/user_avatar/community.thunkable.com/uyenchowjkj8/32/95881_2.png) [@uyenchowjkj8](https://community.thunkable.com/u/uyenchowjkj8)\
**Post date:** [June 29, 2022, 6:17am UTC](https://community.thunkable.com/t/oops-my-project-did-not-build-android/1944973/1 "2022-06-29T06:17:14Z")

</div>

> Error: Command failed: cd /thunkable/androidBuildServer/…/thunkableCompanion/android/; ./gradlew AssembleRelease ![⚠️](https://fonts.gstatic.com/s/e/notoemoji/14.0/26a0_fe0f/32.png) Cannot resolve the path to “@react-native-community/cli” package. ![⚠️](https://fonts.gstatic.com/s/e/notoemoji/14.0/26a0_fe0f/32.png) Cannot resolve the path to “@react-native-community/cli” package. FAILURE: Build failed with an exception. \* What went wrong: Execution failed for task ‘:app:packageRelease’. \> A failure occurred while executing com.android.build.gradle.internal.tasks.Workers$ActionFacade \> com.android.ide.common.signing.KeytoolException: Failed to read key AndroidKey from store “/thunkable/thunkableCompanion/android/upload.keystore”: null \* Try: Run with --stacktrace option to get the stack trace. Run with --info or --debug option to get more log output. Run with --scan to get full insights. \* Get more help at [https://help.gradle.org](https://help.gradle.org/) BUILD FAILED in 2m 48s

I can’t download my app. help me ☹

---

<div class="post-metadata">

**Author:** ![zander](https://avatars.discourse-cdn.com/v4/letter/z/ecb155/32.png) [@zander](https://community.thunkable.com/u/zander)\
**Post date:** [June 29, 2022, 11:05am UTC](https://community.thunkable.com/t/oops-my-project-did-not-build-android/1944973/2 "2022-06-29T11:05:25Z")

</div>

Is this project a copy?

---

<div class="post-metadata">

**Author:** ![muneer](https://sea1.discourse-cdn.com/flex015/user_avatar/community.thunkable.com/muneer/32/75210_2.png) [@muneer](https://community.thunkable.com/u/muneer)\
**Post date:** [June 29, 2022, 11:25am UTC](https://community.thunkable.com/t/oops-my-project-did-not-build-android/1944973/3 "2022-06-29T11:25:33Z")

</div>

This happens when you try to build the project that is a copy from another account that has already been built. You need to import the original keystore or create your own and provide your own bundle ID.

---

<div class="post-metadata">

**Author:** ![jared](https://sea1.discourse-cdn.com/flex015/user_avatar/community.thunkable.com/jared/32/138473_2.png) [@jared](https://community.thunkable.com/u/jared)\
**Post date:** [June 29, 2022, 12:27pm UTC](https://community.thunkable.com/t/oops-my-project-did-not-build-android/1944973/4 "2022-06-29T12:27:27Z")

</div>

Can you try making a remix of this project, updating the bundleID of the remixed version, then to download the remixed version

---

<div class="post-metadata">

**Author:** ![jared](https://sea1.discourse-cdn.com/flex015/user_avatar/community.thunkable.com/jared/32/138473_2.png) [@jared](https://community.thunkable.com/u/jared)\
**Post date:** [July 2, 2022, 5:01pm UTC](https://community.thunkable.com/t/oops-my-project-did-not-build-android/1944973/5 "2022-07-02T17:01:08Z")

</div>

Circling back around here @uyenchowjkj8

Did you make any progress?

---

<div class="post-metadata">

**Author:** ![ioannisroungeris](https://sea1.discourse-cdn.com/flex015/user_avatar/community.thunkable.com/ioannisroungeris/32/109459_2.png) [@ioannisroungeris](https://community.thunkable.com/u/ioannisroungeris)\
**Post date:** [July 10, 2022, 5:42pm UTC](https://community.thunkable.com/t/oops-my-project-did-not-build-android/1944973/6 "2022-07-10T17:42:52Z")

</div>

I was facing the same issue.

An easy solution that I found on this is:  
I requested “publish Android”, it worked and then I tried again the “Download Android” and it worked

Let me know if that works also for you.

---

<div class="post-metadata">

**Author:** ![jared](https://sea1.discourse-cdn.com/flex015/user_avatar/community.thunkable.com/jared/32/138473_2.png) [@jared](https://community.thunkable.com/u/jared)\
**Post date:** [August 19, 2022, 1:31am UTC](https://community.thunkable.com/t/oops-my-project-did-not-build-android/1944973/7 "2022-08-19T01:31:13Z")

</div>

This topic was automatically closed 3 days after the last reply. New replies are no longer allowed.
