# Error ---\>\>\> Something went wrong when we tried to build your project

**URL:** <https://community.thunkable.com/t/error-something-went-wrong-when-we-tried-to-build-your-project/1205707>\
**Category:** Questions about Thunkable X\
**Created:** [April 4, 2021, 6:06pm UTC](https://community.thunkable.com/t/error-something-went-wrong-when-we-tried-to-build-your-project/1205707 "2021-04-04T18:06:30Z")\
**Posts on this page:** 3\
**Page:** 1

<div class="post-metadata">

**Author:** ![markettopandou4](https://avatars.discourse-cdn.com/v4/letter/m/90db22/32.png) [@markettopandou4](https://community.thunkable.com/u/markettopandou4)\
**Post date:** [April 4, 2021, 6:06pm UTC](https://community.thunkable.com/t/error-something-went-wrong-when-we-tried-to-build-your-project/1205707/1 "2021-04-04T18:06:30Z")

</div>

hi all, I encountered the following error after installing the keystore file and password.  
I try to download but still the same error.  
How can I solve?  
Thanks Marco

Error:  
**Something went wrong when we tried to build your project**  **MyFamily** \*\*.\*\*

Here are the details:

Error: Command failed: cd /androidBuildServer/…/thunkableCompanion/android/; ./gradlew AssembleRelease FAILURE: Build failed with an exception. \* What went wrong: Execution failed for task ‘:app:packageRelease’. \> A failure occurred while executing com.android.build.gradle.internal.tasks.Workers$ActionFacade \> com.android.ide.common.signing.KeytoolException: Failed to read key AndroidKey from store “/thunkableCompanion/android/upload.keystore”: No key with alias ‘AndroidKey’ found in keystore /thunkableCompanion/android/upload.keystore \* Try: Run with --stacktrace option to get the stack trace. Run with --info or --debug option to get more log output. Run with --scan to get full insights. \* Get more help at [https://help.gradle.org](https://help.gradle.org) BUILD FAILED in 51s

Reference ID: 75feea9f-3ff1-4345-84ef-ac3608725d60

---

<div class="post-metadata">

**Author:** ![domhnallohanlon](https://sea1.discourse-cdn.com/flex015/user_avatar/community.thunkable.com/domhnallohanlon/32/29554_2.png) [@domhnallohanlon](https://community.thunkable.com/u/domhnallohanlon)\
**Post date:** [April 4, 2021, 9:00pm UTC](https://community.thunkable.com/t/error-something-went-wrong-when-we-tried-to-build-your-project/1205707/2 "2021-04-04T21:00:48Z")

</div>

Hey @markettopandou4,

Where did you get the keystore from?

Are you trying to publish an already-published app?

---

<div class="post-metadata">

**Author:** ![ioannis](https://sea1.discourse-cdn.com/flex015/user_avatar/community.thunkable.com/ioannis/32/146956_2.png) [@ioannis](https://community.thunkable.com/u/ioannis)\
**Post date:** [November 8, 2024, 1:25pm UTC](https://community.thunkable.com/t/error-something-went-wrong-when-we-tried-to-build-your-project/1205707/4 "2024-11-08T13:25:32Z")

</div>


